هشیاری
type: Concept
preferred label: Consciousness @en
related: مکاشفه برین

مکاشفه برین
type: Concept
alternative label: مكاشفه عرفاني
preferred label: Transcendental Meditation @en
related: هشیاری
related: تغییر رفتار
scope note: در مورد نهضت دینی خاص و برای مكاشفه به‌عنوان شكلی از بازآفرینی یا روش بهبود وضعیت خویش به‌كار رفته است.

تغییر رفتار
type: Concept
preferred label: Behavior Modification @en
related: مکاشفه برین