فرایند مارکوف
type: Concept
broader: مدل‌بختی
preferred label: Markov Process @en
related: احتمال
scope note: مدل آماری كه احتمال وقوع یك رویداد مبتنی بر احتمالات وضع حال و بلافاصله حالت‌های قبلی‌اش را بدون درنظر‌گرفتن سایر دوره‌های زمانی معین می‌كند.

مدل‌بختی
type: Concept
narrower: فرایند مارکوف
preferred label: Stochastic Models @en

احتمال
type: Concept
preferred label: Probability @en
related: فرایند مارکوف