روشنگری
type: Concept
broader: دوره زمانی
preferred label: Enlightenment @en
related: قرن هجدهم
scope note: جنبش فلسفی قرن 18 میلادی كه نگرشی عقلانی و علمی را در دنیا ترویج كرد و دید جدیدی به پیشرفت انسان داشت.

قرن هجدهم
type: Concept
preferred label: Eighteenth Century @en
related: روشنگری

دوره زمانی
type: Concept
narrower: روشنگری
preferred label: Time Periods @en