اسپرانتو
type: Concept
broader: زبان‌ها
preferred label: Esperanto @en
scope note: زبان ساختگی است كه در سال 1877 توسط "ال.ال.زامنهوف" اختراع شد. این زبان به‌طور اساسی بر پایه زبان‌های رومیایی است.

زبان‌ها
type: Concept
narrower: اسپرانتو
preferred label: Languages @en