خط‌شناسی
type: Concept
preferred label: Graphology @en
related: روان‌شناسی
related: ویژگی شخصیت
scope note: روش‌های استنباط ویژگی‌های شخصیتی از روی نمونه‌های دست‌نوشت.

روان‌شناسی
type: Concept
preferred label: Psychology @en
related: خط‌شناسی

ویژگی شخصیت
type: Concept
preferred label: Personality Traits @en
related: خط‌شناسی