صنعت خودرو
type: Concept
broader: صنعت کارخانه‌ای
preferred label: Automobile Industry @en
related: خودرو
scope note: مجموعه آمارهای اقتصادی و سوابق آماری مربوط به خودروسازی در یك كشور.

صنعت کارخانه‌ای
type: Concept
narrower: صنعت خودرو
preferred label: Manufacturing Industries @en

خودرو
type: Concept
preferred label: Automobiles @en
related: صنعت خودرو