رابطه خانوادگی
type: Concept
preferred label: Family Relations @en
related: خانواده سالاری

خانواده سالاری
type: Concept
alternative label: خانواده گرايي
preferred label: Familism @en
related: رابطه خانوادگی
related: خانواده
scope note: نظام اجتماعی كه در این نظام گروه خانواده مهم‌ترین و اساسی‌ترین عنصر اجتماع است. وحدت این گروه مورد احترام بسیار است.

خانواده
type: Concept
preferred label: Family @en
related: خانواده سالاری