برلین، جمهوری دمکراتیک آلمان
type: Concept
broader: جمهوری دمکراتیک آلمان
preferred label: Berlin, German Democratic Republic @en

جمهوری دمکراتیک آلمان
type: Concept
broader: اروپای شرقی
narrower: برلین، جمهوری دمکراتیک آلمان
preferred label: German Democratic Republic @en
scope note: فقط برای جمهوری دمكراتیك آلمان قبل از ملحق شدن به جمهوری فدرال آلمان در سال 1990 به‌كار می‌رود.

اروپای شرقی
type: Concept
narrower: جمهوری دمکراتیک آلمان
preferred label: Eastern Europe @en