تنبیه بدنی
type: Concept
broader: مجازات
preferred label: Corporal Punishment @en
related: شیوه پرورش کودک
scope note: تحمیل درد جسمی بر فرد توسط فرد دیگر برای مقاصد انضباطی.

مجازات
type: Concept
narrower: تنبیه بدنی
preferred label: Punishment @en

شیوه پرورش کودک
type: Concept
preferred label: Childrearing Practices @en
related: تنبیه بدنی