پژوهش جامعه‌شناختی
type: Concept
preferred label: Sociological Research @en
related: جامعه‌نگاری

جامعه‌شناسی
type: Concept
preferred label: Sociology @en
related: جامعه‌نگاری

جامعه‌نگاری
type: Concept
preferred label: Sociography @en
related: پژوهش جامعه‌شناختی
related: جامعه‌شناسی
scope note: تجزیه و تحلیل توصیفی روابط خاص اجتماعی در یك محیط خاص.