سرکوب(ساز و کار دفاعی)
type: Concept
preferred label: Repression (Defense Mechanism) @en
related: اجتناب

اجتناب
type: Concept
preferred label: Avoidance @en
related: سرکوب(ساز و کار دفاعی)
related: کنارآمدن
scope note: ساز‌ و‌ كار دفاعی كه با امتناع از روبه‌روشدن با موقعیت‌ها، سوژه‌ها یا فعالیت‌ها مشخص می‌شود.

کنارآمدن
type: Concept
preferred label: Coping @en
related: اجتناب