والدیت تعمیدی
type: Concept
preferred label: Godparenthood @en
related: کمپادرازگو

خویشاوندی
type: Concept
preferred label: Kinship @en
related: کمپادرازگو

کمپادرازگو
type: Concept
preferred label: Compadrazgo @en
related: والدیت تعمیدی
related: خویشاوندی
scope note: مناسبات روحانی در كشورهای اسپانیولی زبان بین یك پدر یا یك مادر ایمانی یا والدین ایمانی و یك فرزند ایمانی و والدینش.