کارگر یقه‌سفید
type: Concept
preferred label: White Collar Workers @en
related: طبقه متوسط جدید

طبقه متوسط جدید
type: Concept
broader: طبقه متوسط
preferred label: New Middle Class @en
related: کارگر یقه‌سفید
scope note: شاغلین حقوق‌بگیر در حرفه‌های كارمندی، اداری، فروش، و فنی كه نسبتاً از موقعیت اجتماعی پائین و قدرت اجتماعی اندكی برخوردارند. گاهی مترادف كارگران یقه‌سفید، كارآفرینان، مدیران و كارگران حرفه‌ای است.

طبقه متوسط
type: Concept
narrower: طبقه متوسط جدید
preferred label: Middle Class @en