پروتستانیسم
type: Concept
preferred label: Protestantism @en
related: روش باور

روش باور
type: Concept
alternative label: متديست
broader: پروتستان
preferred label: Methodists @en
related: پروتستانیسم
scope note: فرقه‌‌ای از پروتستان‌های مسیحی كه به‌علّت روش صحیح مطالعه و عبادت، این نام را روی خود گذاشتند.

پروتستان
type: Concept
narrower: روش باور
preferred label: Protestants @en