ایدئولوژی سیاسی
preferred label: Political Ideologies @en
type: Concept
related: فیزیوکرات

فیزیوکرات
scope note: گروه اقتصاد‌دانان فرانسوی قرن هجدهم و در راس آنها "فرانسوا كنه" قرار داشت كه علیه دست‌یازی سیاسی در نظام اقتصادی طبیعی بحث می‌كرد و عقیده داشت كه كشاورزی، تنها منبع ثروت و تنها منبع درست درآمد عمومی است.
related: اقتصاد‌دان
related: ایدئولوژی سیاسی
preferred label: Physiocrats @en
type: Concept

اقتصاد‌دان
preferred label: Economists @en
type: Concept
related: فیزیوکرات