تغییر رفتار
preferred label: Behavior Modification @en
type: Concept
related: مکاشفه برین

مکاشفه برین
alternative label: مكاشفه عرفاني
scope note: در مورد نهضت دینی خاص و برای مكاشفه به‌عنوان شكلی از بازآفرینی یا روش بهبود وضعیت خویش به‌كار رفته است.
related: هشیاری
related: تغییر رفتار
preferred label: Transcendental Meditation @en
type: Concept

هشیاری
preferred label: Consciousness @en
type: Concept
related: مکاشفه برین