خط‌شناسی
scope note: روش‌های استنباط ویژگی‌های شخصیتی از روی نمونه‌های دست‌نوشت.
related: روان‌شناسی
related: ویژگی شخصیت
preferred label: Graphology @en
type: Concept

روان‌شناسی
preferred label: Psychology @en
type: Concept
related: خط‌شناسی

ویژگی شخصیت
preferred label: Personality Traits @en
type: Concept
related: خط‌شناسی