بیماری
preferred label: Diseases @en
type: Concept
narrower: سندروم نقص ایمنی اکتسابی

سندروم نقص ایمنی اکتسابی
alternative label: ايدز
scope note: ضعف سیستم ایمنی ناشی از عفونت ویروسی در جریان آمیزش جنسی و انتقال خون در اثر خون آلوده كه با عفونت‌های فرصت طلب بعدی به‌ویژه ساركوم كاپوسی و سینه پهلو منجر به مرگ می‌شود.
related: مسایل بهداشتی
broader: بیماری
preferred label: Acquired Immune Deficiency Syndrome @en
type: Concept

مسایل بهداشتی
preferred label: Health Problems @en
type: Concept
related: سندروم نقص ایمنی اکتسابی