والدیت تعمیدی
preferred label: Godparenthood @en
type: Concept
related: کمپادرازگو

خویشاوندی
preferred label: Kinship @en
type: Concept
related: کمپادرازگو

کمپادرازگو
scope note: مناسبات روحانی در كشورهای اسپانیولی زبان بین یك پدر یا یك مادر ایمانی یا والدین ایمانی و یك فرزند ایمانی و والدینش.
related: والدیت تعمیدی
related: خویشاوندی
preferred label: Compadrazgo @en
type: Concept