پروتستان
preferred label: Protestants @en
type: Concept
narrower: پرسبیتری

پروتستانیسم
preferred label: Protestantism @en
type: Concept
related: پرسبیتری

پرسبیتری
scope note: پیرو كلیسای مشایخی یا كلیسای شبانی كه شعبه‌ای از كلیسای پروتستان و مبتنی بر عقاید كالوین است.
related: پروتستانیسم
broader: پروتستان
preferred label: Presbyterians @en
type: Concept