نخبگان سیاسی
preferred label: Political Elites @en
type: Concept
related: چند سالاری

نظام سیاسی
preferred label: Political Systems @en
type: Concept
narrower: چند سالاری

چند سالاری
alternative label: پلي‌آرشي
scope note: حكومتی كه با موازنه قدرت بین رهبران و شركت‌كنندگان فعال خارج از هیات رهبری مشخص می‌شود.
related: نخبگان سیاسی
broader: نظام سیاسی
preferred label: Polyarchy @en
type: Concept