روسیه
preferred label: Russia @en
type: Concept
narrower: مسکو، روسیه

مسکو، روسیه
scope note: شامل روسیه قبل، در دوره، و بعد از دوران شوروی.
broader: روسیه
preferred label: Moscow, Russia @en
type: Concept