مهاجرت
preferred label: Migration @en
type: Concept
narrower: مهاجرت بازگشتی

مهاجرت بازگشتی
scope note: تغییر دائمی یا نیمه دائمی اقامتگاه و برگشت به جایی كه شخص قبلاً در آن ساكن بوده است.
related: مهاجرت از شهر به روستا
broader: مهاجرت
preferred label: Return Migration @en
type: Concept

مهاجرت از شهر به روستا
preferred label: Urban to Rural Migration @en
type: Concept
related: مهاجرت بازگشتی