زبان‌های آفریقایی
preferred label: African Languages @en
type: Concept
narrower: سواحلی(زبان)

سواحلی(زبان)
scope note: از زبان‌های آفریقایی كه در آفریقای شرقی رایج است.
broader: زبان‌های آفریقایی
preferred label: Swahili @en
type: Concept