صنعت خودرو
scope note: مجموعه آمارهای اقتصادی و سوابق آماری مربوط به خودروسازی در یك كشور.
related: خودرو
broader: صنعت کارخانه‌ای
preferred label: Automobile Industry @en
type: Concept

صنعت کارخانه‌ای
preferred label: Manufacturing Industries @en
type: Concept
narrower: صنعت خودرو

خودرو
preferred label: Automobiles @en
type: Concept
related: صنعت خودرو