ناتوانی یادگیری
preferred label: Learning Disabilities @en
type: Concept
related: زبان‌پریشی

اختلال زبانی
preferred label: Language Disorders @en
type: Concept
narrower: زبان‌پریشی

زبان‌پریشی
scope note: از‌ دست‌رفتن توانایی جزیی یا كامل صحبت‌ كردن كه ناشی از اختلال در رشد و بالندگی، بیماری یا آسیب مغزی است.
related: ناتوانی یادگیری
broader: اختلال زبانی
preferred label: Aphasia @en
type: Concept