اجتناب
scope note: ساز‌ و‌ كار دفاعی كه با امتناع از روبه‌روشدن با موقعیت‌ها، سوژه‌ها یا فعالیت‌ها مشخص می‌شود.
related: سرکوب(ساز و کار دفاعی)
related: کنارآمدن
preferred label: Avoidance @en
type: Concept

کنارآمدن
preferred label: Coping @en
type: Concept
related: اجتناب

سرکوب(ساز و کار دفاعی)
preferred label: Repression (Defense Mechanism) @en
type: Concept
related: اجتناب