بزهکاری
preferred label: Delinquency @en
type: Concept
related: نظریه خنثی‌سازی

جرم
preferred label: Crime @en
type: Concept
related: نظریه خنثی‌سازی

نظریه خنثی‌سازی
alternative label: نظريه بي‌طرف‌سازي
scope note: دیدگاهی كه به‌موجب آن، بزهكاران اغلب جمله‌بندی‌های زبانی را برای خنثی‌كردن(یعنی توجیه یا دلیل‌تراشی) تقصیر ناشی از رفتار بزهكارانه‌شان، مثل انكار مسئولیت یا آسیب، مقصر‌دانستن قربانی یا شاكیان، به‌كار می‌برند.
related: جرم
related: بزهکاری
preferred label: Neutralization Theory @en
type: Concept