پروتستان
preferred label: Protestants @en
type: Concept
narrower: مورمون

پروتستانیسم
preferred label: Protestantism @en
type: Concept
related: مورمون

مورمون
scope note: پیرو فرقه‌ای از مسیحیت كه سال 1830 توسط "ژوزف اسمیت" در آمریكا پایه‌گذاری شد.
related: پروتستانیسم
broader: پروتستان
preferred label: Mormons @en
type: Concept