حسیدیم
scope note: نهضت یهودی قرن دوم پیش از میلاد كه مخالف یونانی‌كردن آداب دینی و طرز زندگی یهودیان بود.
related: حسیدیسم
broader: یهودی
preferred label: Hassidim @en
type: Concept

یهودی
preferred label: Jews @en
type: Concept
narrower: حسیدیم

حسیدیسم
preferred label: Hassidism @en
type: Concept
related: حسیدیم