سالمند
preferred label: Elderly @en
type: Concept
related: پیرسالاری

پیرسالاری
scope note: نوعی از سازمان‌بندی اجتماعی كه در آن كهنسال یا كمیته‌ای از پیران جامعه مطابق با شأن و مقام سنی‌شان، بر نظام سیاسی و اجتماعی تسلط دارند.
related: سالمند
broader: نظام سیاسی
preferred label: Gerontocracy @en
type: Concept

نظام سیاسی
preferred label: Political Systems @en
type: Concept
narrower: پیرسالاری