تحمل ایمنی اکتسابی
type: Concept
alternative label: تحمل ايمني مصنوعي
broader: تحمل ایمنی
preferred label: acquired immunotolerance @en
scope note: antigen-specific immunological unresponsiveness induced artificially; for immunotolerance arising naturally use natural immunotolerance

تحمل ایمنی
type: Concept
narrower: تحمل ایمنی اکتسابی
preferred label: immune tolerance @en