premunition
type: Concept
alternative label: premunity
broader: immunity by process
preferred label: پیش‌زینهاری @fa
related: immunity
scope note: resistance to reinfection after an acute infection has become chronic @fa

immunity by process
type: Concept
narrower: premunition
preferred label: ایمنی براساس فرایند @fa

immunity
type: Concept
preferred label: ایمنی @fa
related: premunition