ریزصاف‌کردن
type: Concept
broader: صاف‌کردن
preferred label: microfiltration @en
scope note: filtration that separates in the 0.02 to 2.0 micron range

صاف‌کردن
type: Concept
narrower: ریزصاف‌کردن
preferred label: filtration @en