تکثیر همگروهی
type: Concept
broader: روش‌های اصلاح نژاد گیاهان
preferred label: clonal propagation @en
scope note: production of genetically identical plants

روش‌های اصلاح نژاد گیاهان
type: Concept
narrower: تکثیر همگروهی
preferred label: plant breeding methods @en