همگروه سازی سلول
type: Concept
broader: روش‌های اصلاح نژاد عمومی
preferred label: cell cloning @en
scope note: production of genetically identical cells

روش‌های اصلاح نژاد عمومی
type: Concept
narrower: همگروه سازی سلول
preferred label: general breeding methods @en