زراعت‌های چندکشتی
type: Concept
alternative label: کشت چند طبقه اي
broader: کشت توام
preferred label: multistorey cropping @en
scope note: agroforestry systems with multiple species of annuals and perennials with an existing stand of perennials

کشت توام
type: Concept
narrower: زراعت‌های چندکشتی
preferred label: intercropping @en