نژادهای خوک
type: Concept
broader: نژادهای بز
preferred label: pig breeds @en
related: خوک‌ها
scope note: only important and recognised breeds are listed

نژادهای بز
type: Concept
narrower: نژادهای خوک
preferred label: goat breeds @en

خوک‌ها
type: Concept
preferred label: pigs @en
related: نژادهای خوک