ابرانگلی
type: Concept
broader: زندگی انگلی
preferred label: superparasitism @en
scope note: parasitism where the parasite burden from a single species is greater than the host can sustain

زندگی انگلی
type: Concept
narrower: ابرانگلی
preferred label: parasitism @en