فراشبه‌انگل‌ها
type: Concept
preferred label: hyperparasitoids @en
related: فزون‌انگلی

فزون‌انگلی
type: Concept
broader: زندگی انگلی
preferred label: hyperparasitism @en
related: فراشبه‌انگل‌ها
scope note: parasitism of a parasite or parasitoid which is itself parasitizing a host

زندگی انگلی
type: Concept
narrower: فزون‌انگلی
preferred label: parasitism @en