زارعان
type: Concept
preferred label: farmers @en
related: حقوق کشاورزان

حقوق کشاورزان
type: Concept
broader: حقوق قانونی
preferred label: farmers' rights @en
related: زارعان
scope note: rights of farmers to control the seed and other propagation materials grown on their farms and to obtain benefit from the germplasm they preserve

حقوق قانونی
type: Concept
narrower: حقوق کشاورزان
preferred label: legal rights @en