آسم
preferred label: asthma @en
type: Concept
related: ناسرشتی

ناسرشتی
scope note: genetic predisposition to immediate hypersensitivity reactions
related: آسم
broader: پرحساسیتی
preferred label: atopy @en
type: Concept

پرحساسیتی
preferred label: hypersensitivity @en
type: Concept
narrower: ناسرشتی