ایمنی متقاطع
preferred label: cross immunity @en
type: Concept
related: واکنش متقاطع

واکنش‌های پادگن پادتن
preferred label: antigen antibody reactions @en
type: Concept
narrower: واکنش متقاطع

واکنش متقاطع
scope note: reaction of an antibody with an antigen that was not used to induce it
related: ایمنی متقاطع
broader: واکنش‌های پادگن پادتن
preferred label: cross reaction @en
type: Concept