بیماری‌های ایمنی‌شناختی
preferred label: immunological diseases @en
type: Concept
narrower: بیماری‌های کمپلکس ایمنی

بیماری‌های کمپلکس ایمنی
scope note: diseases resulting from the deposition of antigen antibody complexes in tissues
related: کمپلکس‌های ایمنی
broader: بیماری‌های ایمنی‌شناختی
preferred label: immune complex diseases @en
type: Concept

کمپلکس‌های ایمنی
preferred label: immune complexes @en
type: Concept
related: بیماری‌های کمپلکس ایمنی