عفونت‌ها
preferred label: infections @en
type: Concept
narrower: عفونت‌های مختلط

عفونت‌های مختلط
alternative label: عفونت‌هاي دوگانه
scope note: simultaneous infections at the same site by more than one organism
related: علت‌شناسی
broader: عفونت‌ها
preferred label: mixed infections @en
type: Concept

علت‌شناسی
preferred label: aetiology @en
type: Concept
related: عفونت‌های مختلط