واکسن
preferred label: vaccines @en
type: Concept
narrower: واکسن چندارزشی

واکسن چندارزشی
scope note: vaccines intended to protect against different strains of the same infectious organism
broader: واکسن
preferred label: polyvalent vaccines @en
type: Concept