ایالات شمال غربی پاسیفیک از ایالات متحده آمریکا
preferred label: Pacific Northwest States of USA @en
type: Concept
narrower: واشینگتن

واشینگتن
scope note: the State; for D.C. use District of Columbia
broader: ایالات شمال غربی پاسیفیک از ایالات متحده آمریکا
preferred label: Washington @en
type: Concept