افزایش وزن
scope note: for man only; for animals use liveweight gain
related: وزن
broader: وزن
preferred label: weight gain @en
type: Concept

وزن
preferred label: weight @en
type: Concept
narrower: افزایش وزن
related: افزایش وزن