فزون‌انگلی
scope note: parasitism of a parasite or parasitoid which is itself parasitizing a host
related: فراشبه‌انگل‌ها
broader: زندگی انگلی
preferred label: hyperparasitism @en
type: Concept

فراشبه‌انگل‌ها
preferred label: hyperparasitoids @en
type: Concept
related: فزون‌انگلی

زندگی انگلی
preferred label: parasitism @en
type: Concept
narrower: فزون‌انگلی