تمایز
preferred label: differentiation @en
type: Concept
narrower: تمایز سلول

تمایز سلول
alternative label: تمايز سلولي
scope note: developmental process leading to specialization in form and function of cells, tissues and organs
broader: تمایز
preferred label: cell differentiation @en
type: Concept